Access Risk Knowledge Ontology Amarach Report Ontology
type: Ontology
version IRI: https://ARKAmarach.adaptcentre.ie/Ontologies/ARKAmarach/0.1
contributor: Conor Nolan
contributor: Jessica Brown
contributor: Nick McDonald
contributor: Rob Brennan
creator: Yalemisew Abgaz
description: A model for representing concepts, relationships and axioms for Aviation Risk Knowledge flight operaiton reporting system.
issued: 02/07/2019
modified: 02/07/2019
publisher: https://www.ARKAmarach.adaptcentre.ie/
rights: https://creativecommons.org/licenses/by-nc/4.0/
preferred namespace prefix: ARKAM
preferred namespace uri: https://ARKAmarach.adaptcentre.ie/Ontologies/ARKAmarach#
version info: 0.1
type: NamedIndividual

has aircraft status
type: ObjectProperty
domain: Report
range: Aircraft Status
description: Relates the aircraft status with a given report

hasCityJetInformation
type: ObjectProperty
domain: Report
range: City Jet Information
description: A relationship linking a report with City Jet information

has crew change
type: ObjectProperty
domain: Report
range: Crew Changes
description: The crew change information a report contains

has crew coupling
type: ObjectProperty
domain: Report
range: Crew Coupling
description: The crew coupling information a report contains

has flight load
type: ObjectProperty
domain: Report
range: Flight Load
description: Links a report with a flight load

has flight turnaround
type: ObjectProperty
domain: Report
range: Flights with Turnaround
description: The flight turnaround information a report contains

has focus flight
type: ObjectProperty
domain: Report
range: Focused Flight
description: Relates the focus flight information with a given report

has future issue
type: ObjectProperty
domain: Report
range: Future Issue
description: Relates the information about the future issue with a report

has inbound route
type: ObjectProperty
domain: Report
range: Route
description: Links a route with a report

has irregular operation
type: ObjectProperty
domain: Report
range: Irregular Operation
description: The irregular operation information contained in a Report

has mainline standby
type: ObjectProperty
domain: Report
range: Main Line Standby
description: Relates the mainline standby information with a given report

has operational issue
type: ObjectProperty
domain: Report
range: Operational Issue
description: Relates the information about operational issue with a report

has operational status
type: ObjectProperty
domain: Report
range: Operational Status
description: The hasOperationalStatus relationship relates the report with the operational status information

has option for cancellation
type: ObjectProperty
domain: Report
range: Cancellation
description: A property that links a report with the cancellation options for flights

has overbooking
type: ObjectProperty
domain: Report
range: Overbooking
description: A property that links the report with the details of flight overbooking

has overnight maintenance
type: ObjectProperty
domain: Report
range: Overnight Maintenance
description: links an overnight maintenance information with a specific report

has PBZ flight
type: ObjectProperty
domain: Report
range: PBZ Flight
description: this property relates the PBZ flight information with the a given report

has PRM special Handling
type: ObjectProperty
domain: Report
range: PRM Special Handling
description: A property that links the report with PRM special handling

has report participant
type: ObjectProperty
domain: Report
range: Amarach Report Participants
description: A relationship linking a report with the participants in the report

has security
type: ObjectProperty
domain: Report
range: Security
description: A relationship which links a report with security information

has standby cabin crew
type: ObjectProperty
domain: Report
range: Standby Cabin Crew
description: Relates the cabin crew information with a report

has standby pilot
type: ObjectProperty
domain: Report
range: Standby Pilot
description: Relates the standby pilots information with a report

has transfer detail
type: ObjectProperty
domain: Report
range: Transfer
description: Links a report with the transfer information

has walkout flight
type: ObjectProperty
domain: Report
range: Walkout Flight
description: Relates the walkout information with a given report

has weather
type: ObjectProperty
domain: Report
range: Weather
description: Links a report with the weather information

AKH station low in stock
type: DatatypeProperty
range: Literal
description: needs detail

AVI
type: DatatypeProperty
range: Literal
description: needs detail

Security type
type: DatatypeProperty
range: Literal
description: The type of the security situation where evere there is one

WCHC
type: DatatypeProperty
range: int
description: needs detail

WCHR
type: DatatypeProperty
range: int
description: needs detail

WCHS
type: DatatypeProperty
range: int
description: needs detail

Aircraft registration number
type: DatatypeProperty
range: Literal
description: The aircraft registration number

Aircraft type
type: DatatypeProperty
range: Literal
description: The type of the aircraft

Available number
type: DatatypeProperty
range: int
description: The number of Available standby aircrafts

Available time
type: DatatypeProperty
range: Literal
description: The time of available standby aircraft

Base
type: DatatypeProperty
range: Literal
description: The base location of a standby pilot?

Booked
type: DatatypeProperty
range: Literal
description: nèeds detail

Cabin crew E
type: DatatypeProperty
range: Literal
description: The number of standby cabin crew

Cabin crew L
type: DatatypeProperty
range: Literal
description: The number of standby cabin crew

Cabin crew M
type: DatatypeProperty
range: Literal
description: The number of standby cabin crew

Captain E
type: DatatypeProperty
range: Literal
description: The number of standby captains E

Captain L
type: DatatypeProperty
range: Literal
description: The number of standy captains L

Captain
type: DatatypeProperty
range: Literal
description: The number of standby captains M

Connection
type: DatatypeProperty
range: Literal
description: The number of connectionsin the cancellation

Crew change note
type: DatatypeProperty
range: Literal
description: A note about the crew change

Crew coupling note
type: DatatypeProperty
range: Literal
description: A note about the crew coupling

Day trippers
type: DatatypeProperty
range: Literal
description: The number of daytrippers for firstwave cancellations

De-icing portal
type: DatatypeProperty
range: Literal
description: The information regarding de-icing of an aircraft

Estimated service time
type: DatatypeProperty
range: Literal
description: The estimated service time of an aircraft

First officer E
type: DatatypeProperty
range: Literal
description: The number of standby first officers R

First officer L
type: DatatypeProperty
range: Literal
description: The number of standby first officers L

First officer M
type: DatatypeProperty
range: Literal
description: The number of standby first officers M

First wave zone
type: DatatypeProperty
range: Literal
description: The zone of the first wave flights (dub eur, dub-lhr etc)

Flight number
type: DatatypeProperty
range: Literal
description: The flight number

Guest booked
type: DatatypeProperty
range: Literal
description: The total number of guests booked in that day

Human remain
type: DatatypeProperty
range: Literal
description: Information about the presence of a human remain on a flight

Inbound
type: DatatypeProperty
range: Literal
description: The number of inbound transferes. Needs detail

IDMCR status
type: DatatypeProperty
range: Literal
description: needs detail

Load factor
type: DatatypeProperty
range: Literal
description: The percentage of load of all the aircrafts in a day

Maintenance detail
type: DatatypeProperty
range: Literal
description: Information about the maintenance of an aircraft

Network
type: DatatypeProperty
range: Literal
description: Represents the category of the network of flights as short-haul, long-haul, regional etc

Note
type: DatatypeProperty
range: Literal
description: A note about future flight issues

Number
type: DatatypeProperty
range: Literal
description: A number

Number of escorts
type: DatatypeProperty
range: Literal
description: The number of passengers travelling with a person under security

Onward destination flight
type: DatatypeProperty
range: Literal
description: The flight number of onward destination flights

Onward total
type: DatatypeProperty
range: Literal
description: The total number of passengers travelling onwards

Operation
type: DatatypeProperty
range: Literal
description: needs detail

Operational status
type: DatatypeProperty
range: Literal
description: Note about the operational status of an aircraft

Other information
type: DatatypeProperty
range: Literal
description: Any related information related to security

Outbound transfers
type: DatatypeProperty
range: Literal
description: Number of outbound transfers

Participants
type: DatatypeProperty
range: Literal
description: The name of the parties that are involved in the preparation of Amarach report

Participant status
type: DatatypeProperty
range: Literal
description: The status of the parties that are expected to involve in the preparation of the Amarach report

Planned aircraft status
type: DatatypeProperty
range: Literal
description: The detail description of the planned aircraft status

Recovery overview
type: DatatypeProperty
range: Literal
description: The details of the revocery plan

Risk
type: DatatypeProperty
range: Literal
description: The risk associated with weather

Weather risk
type: DatatypeProperty
range: Literal
description: The risk associated with weather

Color
type: DatatypeProperty
range: Literal
description: needs detail

ASL LTD Operational Status
type: Class
description: Information about ASL ltd aircraft, crew, operational status etc.

Aer Lingus Operational Status
type: Class
description: Information about Aer Lingus regional aircraft, crew, operational status etc.

Aircraft Status
type: Class
comment: The aircraft status detail contains information related to the Aircraft switches, AKH Stations low in stock, de-icing and LDMCR status.
comment: This information needs a better name

Cancellation
type: Class
description: Information about options of cancelation of a given flight zone
comment: This information is not about individual flight, but groups of flights based on zones?

City Jet Information
type: Class
description: Description of City jet flights and crew

Crew Changes
type: Class
description: Information about the crew changes in LHR. Involves crew transportation to/from hotel

Crew Coupling
type: Class
description: Information about crew coupling with greater than 10 hrs FDP
comment: Contains flight information and time. Needs further clarification?

Flight Load
type: Class
description: A high-level load information of flights aggregated based on their network (short-haul, long-haul and regional)
comment: Flight load may be used to indicate the number of booked guests, the load factor, indicator if human remain presents in any of the flights

Flights with Turnaround
type: Class
description: Flights that have a turnaround time less than 40 minutes
comment: The label requires further revision

Focused Flight
type: Class

Future Issue
type: Class
description: A detailed description of any future operational issue affecting the operations of the airline
comment: A free text

Irregular Operation
type: Class
description: A description of long stopped crew, unscheduled overnights and risks to OTP

Main Line Standby
type: Class
description: The standby details of mainline aricrafts
comment: needs more detail

Maintenance
type: Class
description: Information about fleet technical issues and planned overnight maintenance
comment: Maintenance could include both technical issue or a planned overnight maintenance of a given aircraft

Operational Issue
type: Class
description: A detailed description of any operational issue affecting the operations of the airline
comment: A free text

Operational Status
type: Class
description: The operational status of an air craft
comment: needs more detail

Overbooking
type: Class
description: Information describing an overbooking on a given flight
comment: Overbooking is Nil when there is no overbooked flight

Overnight Maintenance
type: Class
description: Overnight maintenance schedule
comment: needs more detail

PBZ Flight
type: Class

PRM Special Handling
type: Class
description: The information about flights that have PRM special handling including wheel chairs. This information is given per flight.
comment: This information needs further description to elaborate the acronyms used such as (PRM, WCHC, WCHR, WCHS)

Amarach Report Participants
type: Class
description: Information about the participants in the preparation of the Amarach report

Report
type: Class
description: The Daily Amarach report prepared by Aer Lingus
comment: Amarach report

Route
type: Class
description: information about the inbound routes that have greater than 10 number of connecting passengers

Security
type: Class
description: Information describing if a given flight has passengers that require a special security
comment: This information is filled when the flight has INAD, Deportee or a prisoner

Standby Aircraft
type: Class
description: An aircraft which is standby to replace any other aircraft in a similar route
comment: This information includes the available number and the availability time. There is risk associated?

Standby Cabin Crew
type: Class

Standby Pilot
type: Class
description: information about the number and details of standby pilots
comment: Pilots categorised by Aircraft types

Transfer
type: Class
description: Information about the transfer details of the inboud and outbound connecting flights
comment: This information is compiled per flight and contains color coded entries. Check this?

Walkout Flight
type: Class
description: needs more detail

Weather
type: Class
description: The state of the atmosphere at a particular airport or flight route
comment: Weather is used in its current form in the report

StandbycabinCrew
description: Information about the number and details of standby crew

has City Jet Information