Access Risk Knowledge Projects Vocabulary - Outdated
type: Ontology
version IRI: ARKProjects
contributor: Ademar Crotti Junior
contributor: Junli Liang
contributor: Lucy McKenna
contributor: Natalia Duda
contributor: Nick McDonald
contributor: Rob Brennan
creator: Yalemisew Abgaz
description: An ontology for modelling for users, data classification & access controls on the Access Risk Knowledge (ARK) Platform. This ontology has been replaced by the ARK Risk Knowledge Platform Vocabulary.
modified: 18/04/2020
modified: 31/03/2021
publisher: https://www.openark.adaptcentre.ie/
rights: https://creativecommons.org/licenses/by-nc/4.0/
rights: deed.en
preferred namespace prefix: ARKP
version info: 0.2

has collaborator
type: ObjectProperty
inverse of: is collaborator of
domain: Project
range: User
comment: Relates the Project with its collaborating User. The collaborator has a read/write/add subproject rights but not grant rights.

has owner
type: ObjectProperty
inverse of: is owner of
domain: Project
range: User
comment: Relates the Project with its owner User. The owner has a full read/write/grant access rights.

has owning organisation
type: ObjectProperty
domain: Project
range: Organisation
creator: Lucy McKenna
comment: Links a project to its owning organisation.

has platform role
type: ObjectProperty
domain: User
range: Platform Role
creator: Lucy McKenna
comment: Links a User to their Platform Role.

has readonly user
type: ObjectProperty
inverse of: is readonly user of
domain: Project
range: User
comment: Relates the Project with its ReadOnlyUser. The readonly user can view a specific Project but has no grant right.

is collaborator of
type: ObjectProperty
domain: User
range: Project
comment: Relates the collaborating User with a project.
inverse of: hasCollaborator

is owner of
type: ObjectProperty
domain: User
range: Project
comment: Relates the Owner User with a Project. The owner has a full read/write/grant access rights.
inverse of: hasOwner

is readonly user of
type: ObjectProperty
domain: User
range: Project
comment: Relates the ReadOnlyUser with a Project.
inverse of: hasReadOnlyUser

has data classification
type: ObjectProperty
domain: Data Entity
range: Data Classification
creator: Lucy McKenna
comment: Ascribes a data classification level to an Entity.

AdminUser
type: Class
subclass of: User
creator: Ademar
comment: An admin user has access to all projects.

Confidential
type: Class
subclass of: Data Classification
creator: Lucy McKenna
comment: Confidential information is defined as information which is protected by Irish and/or E.U. legislation or regulations, HSE policies or legal contracts. The unauthorised or accidental disclosure of this information could adversely impact the organisation, its patients, its staff and its business partners.

Data Classification
type: Class
creator: Lucy McKenna
comment: Use to classifiy the sensitivity of data e.g., a project, an analysis or part of an analysis. Data classification values are adapted from the HSE Information Classification & Handling Policy.

Data Entity
type: Class
subclass of: Entity
creator: Lucy McKenna
comment: A data entity can be Project, a Project Analysis, a Risk, a Cube question or any other unit of data on the ARK Platform.
comment: A subclass of prov:Entity.

Internal
type: Class
subclass of: Data Classification
creator: Lucy McKenna
comment: Internal information is defined as information that is only intended for internal distribution within an organisation. In the majority of instances there would be no significant impact on the organisation, its staff, clients or patients if this type of information was mishandled or accidentally released.

Personal
type: Class
subclass of: Restricted
creator: Lucy McKenna
comment: Restricted information that contains personal data. Personal data, as defined by the General Data Protection Regulation (GDPR), is any data that relates to a person or that could be used to identify a person.

Platform Role
type: Class
creator: Lucy McKenna
comment: The role of a User on the ARK Platform.

Public
type: Class
subclass of: Data Classification
creator: Lucy McKenna
comment: Public information is defined as information that is available to the general public and is intended for distribution outside an organisation. There would be no impact on the organisation, its staff, clients or patients if this type of information was mishandled or accidentally released.

Restricted
type: Class
subclass of: Data Classification
creator: Lucy McKenna
comment: Restricted information is defined as highly sensitive confidential information. The unauthorised or accidental disclosure of this information would seriously and adversely impact the organisation, its patients, its staff and its business partners.

Special Category
type: Class
subclass of: Personal
creator: Lucy McKenna
comment: Special Category personal data, as defined by the General Data Protection Regulation (GDPR) Article 9, is any information that reveals a person's race, ethnic origin, political opinion, religious or philosophical beliefes, trade union membership, genetic data, biometric data for the purpose of uniquely identifying a natural person, data concerning health or data concerning a natural person’s sex life or sexual orientation.

User
type: Class
subclass of: Person
description: A User of the ARK Platform. A User is a subclass of arkc:Person.
comment: The user of the project can take three types. Owner, Collaborator, ReadOnlyUser.

Board Member
type: NamedIndividual
type: Platform Role
creator: Lucy McKenna
date: 2021-03-23T18:48:03+00:00
comment: Member of the governing body of an organisation. Responsible for developing and reviewing the organisation’s mission and strategy. Guides the organisation’s long-term goals and policies.

Clinical Specialist
type: NamedIndividual
type: Platform Role
creator: Lucy McKenna
date: 2021-03-23T18:47:03+00:00
comment: Plays a role in the management of activities and staff resources in an area of specialisation.

Frontline Staff
type: NamedIndividual
type: Platform Role
creator: Lucy McKenna
date: 2021-03-23T18:46:03+00:00
comment: Including, but not limited to, firefighters, doctors, nurses, midwives, paramedics, healthcare assistants, social work practitioners and allied health staff who work directly with service users.

Operations Manager
type: NamedIndividual
type: Platform Role
creator: Lucy McKenna
date: 2021-03-23T18:46:47+00:00
comment: Responsible for managing the delivery of quality service user care. This includes, but is not limited to, maintaining, ordering and distributing appropriate Personal Protective Equipment (PPE).

Organisation Executive
type: NamedIndividual
type: Platform Role
creator: Lucy McKenna
date: 2021-03-23T18:47:33+00:00
comment: Responsible for all aspects of operations and for overseeing the functioning of the organisation.

Platform Administrator
type: NamedIndividual
type: Platform Role
creator: Lucy McKenna
comment: An administrator of the ARK Platform.

Safety Manager
type: NamedIndividual
type: Platform Role
creator: Lucy McKenna
date: 2021-03-23T18:49:16+00:00
comment: Directs the collection, measurement and presentation of data required for monitoring service quality and service user safety indicators. Assures compliance with regulations and standards.

Unit Manager
type: NamedIndividual
type: Platform Role
creator: Lucy McKenna
date: 2021-03-23T18:49:54+00:00
comment: Manager of a particular area or group of staff within an organisation e.g. ward manager, nursing manager.